Target
PC4 and SFRS1-interacting protein
Ligand
BDBM50387
Substrate
Meas. Tech.
TR-FRET-based biochemical high throughput dose response assay to identify inhibitors of HIV-1 LEDGF/p75 DNA Integration
IC50
803.96±n/a nM
Citation
 PubChem, PC TR-FRET-based biochemical high throughput dose response assay to identify inhibitors of HIV-1 LEDGF/p75 DNA Integration PubChem Bioassay (2014)[AID] 
Target
Name:
PC4 and SFRS1-interacting protein
Synonyms:
DFS70 LEDGF/p75 PSIP1_HUMAN lens epithelium-derived growth factor p75
Type:
Enzyme Catalytic Domain
Mol. Mass.:
60120.68
Organism:
Homo sapiens (Human)
Description:
gi_6708281
Residue:
530
  
Inhibitor
Name:
BDBM50387
Synonyms:
1-[[(E)-(2,3-dihydroxy-4-keto-cyclohexa-2,5-dien-1-ylidene)methyl]amino]-3-(3-pyridyl)thiourea 1-[[(E)-(2,3-dihydroxy-4-oxocyclohexa-2,5-dien-1-ylidene)methyl]amino]-3-pyridin-3-ylthiourea MLS000416762 cid_5807729
Type:
Small organic molecule
Emp. Form.:
C13H12N4O3S
Mol. Mass.:
304.324
SMILES:
Oc1ccc(C=NNC(=S)Nc2cccnc2)c(O)c1O
: