Target
Amine oxidase [flavin-containing] A
Ligand
BDBM50105417
Substrate
Meas. Tech.
MAO-A/B Activity and Inhibition Assay
pH
7.5±n/a
Ki
8.2e+2± 4.7e+2 nM
Comments
extracted
Citation
 Prusevich, PKalin, JHMing, SABasso, MGivens, JLi, XHu, JTaylor, MSCieniewicz, AMHsiao, PYHuang, RRoberson, HAdejola, NAvery, LBCasero, RATaverna, SDQian, JTackett, AJRatan, RRMcDonald, OGFeinberg, APCole, PA A Selective Phenelzine Analogue Inhibitor of Histone Demethylase LSD1. ACS Chem Biol 9:1284-93 (2014)  
Target
Name:
Amine oxidase [flavin-containing] A
Synonyms:
AOFA_HUMAN MAO-A Monoamine oxidase Monoamine oxidase type A (MAO A) Monoamine oxidase type A (MAOA)
Type:
Protein
Mol. Mass.:
59689.53
Organism:
Homo sapiens (Human)
Description:
P21397
Residue:
527
  
Inhibitor
Name:
BDBM50105417
Synonyms:
CHEMBL1089 PHENELZINE | Phenethyl-hydrazine
Type:
Small organic molecule
Emp. Form.:
C8H12N2
Mol. Mass.:
136.1943
SMILES:
NNCCc1ccccc1
: