Target
Serine/threonine-protein kinase mTOR
Ligand
BDBM116110
Substrate
Meas. Tech.
mTOR Kinase Activity Assay
IC50
0.81±n/a nM
Citation
 Schneider, SKessler, Dvan der Veen, LWunberg, T 5-alkynyl-pyrimidines US Patent  US8633183 Publication Date 1/21/2014 
Target
Name:
Serine/threonine-protein kinase mTOR
Synonyms:
FK506-binding protein 12-rapamycin complex-associated protein 1 FRAP FRAP1 MTOR Mammalian Target of Rapamycin (mTOR) RAFT1 Rapamycin and FKBP12 target 1 Serine/threonine-protein kinase (mTOR) | mTORC2
Type:
Rapamycin target protein
Mol. Mass.:
288917.12
Organism:
Homo sapiens (Human)
Description:
P42345
Residue:
2549
  
Inhibitor
Name:
BDBM116110
Synonyms:
US8633183, E-260
Type:
Small organic molecule
Emp. Form.:
C28H26FN7O
Mol. Mass.:
495.5507
SMILES:
CCNc1ccc(cn1)C#Cc1c(CC)ncnc1-c1ccc(C(=O)N2CCn3ccnc3C2)c(F)c1
: