Target
Serine/threonine-protein kinase mTOR
Ligand
BDBM116146
Substrate
Meas. Tech.
mTOR Kinase Activity Assay
IC50
0.49±n/a nM
Citation
 Schneider, SKessler, Dvan der Veen, LWunberg, T 5-alkynyl-pyrimidines US Patent  US8633183 Publication Date 1/21/2014 
Target
Name:
Serine/threonine-protein kinase mTOR
Synonyms:
FK506-binding protein 12-rapamycin complex-associated protein 1 FRAP FRAP1 MTOR Mammalian Target of Rapamycin (mTOR) RAFT1 Rapamycin and FKBP12 target 1 Serine/threonine-protein kinase (mTOR) | mTORC2
Type:
Rapamycin target protein
Mol. Mass.:
288917.12
Organism:
Homo sapiens (Human)
Description:
P42345
Residue:
2549
  
Inhibitor
Name:
BDBM116146
Synonyms:
US8633183, E-300
Type:
Small organic molecule
Emp. Form.:
C30H29F2N7O2
Mol. Mass.:
557.5938
SMILES:
CCc1ncnc(-c2cc(F)c(C(=O)N3CCN(Cc4nc(C)c(C)o4)CC3)c(F)c2)c1C#Cc1ccc(N)nc1
: