Target
Tyrosine-protein kinase JAK2
Ligand
BDBM116316
Substrate
Meas. Tech.
JAK2 Inhibition Assay
pH
7.2±n/a
Temperature
295.15±n/a K
Ki
0.9±n/a nM
Comments
extracted
Citation
 Blaney, JGibbons, PAHanan, ELyssikatos, JPMagnuson, SRPastor, RRawson, TEZhou, AZhu, B Pyrazolopyrimidine JAK inhibitor compounds and methods US Patent  US8637526 Publication Date 1/28/2014 
Target
Name:
Tyrosine-protein kinase JAK2
Synonyms:
JAK-2 JAK2_HUMAN Janus kinase 2 (JAK2) | Janus kinase 2 (a protein tyrosine kinase)
Type:
Protein
Mol. Mass.:
130684.68
Organism:
Homo sapiens (Human)
Description:
O60674
Residue:
1132
  
Inhibitor
Name:
BDBM116316
Synonyms:
US8637526, 277
Type:
Small organic molecule
Emp. Form.:
C16H11Cl2N7O
Mol. Mass.:
388.211
SMILES:
Nc1ccn2ncc(C(=O)Nc3ccnn3-c3cc(Cl)ccc3Cl)c2n1
: