Target
Non-receptor tyrosine-protein kinase TYK2
Ligand
BDBM50399016
Substrate
Meas. Tech.
JAK1 and TYK2 Inhibition Assay
pH
7.2±n/a
Ki
7.3±n/a nM
Comments
extracted
Citation
 Blaney, JGibbons, PAHanan, ELyssikatos, JPMagnuson, SRPastor, RRawson, TEZhou, AZhu, B Pyrazolopyrimidine JAK inhibitor compounds and methods US Patent  US8637526 Publication Date 1/28/2014 
Target
Name:
Non-receptor tyrosine-protein kinase TYK2
Synonyms:
Non-receptor tyrosine-protein kinase TYK2 (TYK2) TYK2_HUMAN | Tyrosine-protein kinase TYK2
Type:
Protein
Mol. Mass.:
133666.03
Organism:
Homo sapiens (Human)
Description:
P29597
Residue:
1187
  
Inhibitor
Name:
BDBM50399016
Synonyms:
CHEMBL2178803 | US8637526, 225
Type:
Small organic molecule
Emp. Form.:
C19H19N7O
Mol. Mass.:
361.4005
SMILES:
Cc1ccc(C)c(c1)-c1nn(C)cc1NC(=O)c1cnn2ccc(N)nc12
: