Target
Ribosomal protein S6 kinase beta-1
Ligand
BDBM116408
Substrate
Meas. Tech.
Enzyme Assay
pH
7.5±n/a
Temperature
298.15±n/a K
IC50
48.9±n/a nM
Comments
extracted
Citation
 Sutton, AELan, RRichardson, TEPerrey, DVandeveer, HGHuck, BRKarra, SRChen, XXiao, YLiu-Bujalski, LGoutopoulos, AStieber, FHodous, BLQiu, HJones, RHeasley, BH Amino azaheterocyclic carboxamides US Patent  US8637532 Publication Date 1/28/2014 
Target
Name:
Ribosomal protein S6 kinase beta-1
Synonyms:
70 kDa ribosomal protein S6 kinase 1 70 kDa ribosomal protein kinase (p70S6K) Protein kinase 70S6K (T412E) RPS6KB1 Ribosomal protein S6 kinase I STK14A p70S6K1
Type:
Enzyme
Mol. Mass.:
59139.89
Organism:
Homo sapiens (Human)
Description:
His-tagged S6K1.
Residue:
525
  
Inhibitor
Name:
BDBM116408
Synonyms:
US8637532, 89
Type:
Small organic molecule
Emp. Form.:
C18H18N4O2
Mol. Mass.:
322.3611
SMILES:
COc1cc(C(N)=O)c2ncnc(N[C@H](C)c3ccccc3)c2c1
: