Target
Aurora kinase A
Ligand
BDBM116321
Substrate
Meas. Tech.
Enzyme Assay
IC50
430±n/a nM
Citation
 Sutton, AELan, RRichardson, TEPerrey, DVandeveer, HGHuck, BRKarra, SRChen, XXiao, YLiu-Bujalski, LGoutopoulos, AStieber, FHodous, BLQiu, HJones, RHeasley, BH Amino azaheterocyclic carboxamides US Patent  US8637532 Publication Date 1/28/2014 
Target
Name:
Aurora kinase A
Synonyms:
AIK ARK1 AURKA AYK1 Aurora kinase A (AURA) Aurora kinase A (Aurora A) Aurora-related kinase 1 BTAK Breast-tumor-amplified kinase STK15 Serine/threonine kinase 15 Serine/threonine-protein kinase aurora A hARK1
Type:
Serine/threonine-protein kinase
Mol. Mass.:
45830.98
Organism:
Homo sapiens (Human)
Description:
O14965
Residue:
403
  
Inhibitor
Name:
BDBM116321
Synonyms:
US8637532, 2
Type:
Small organic molecule
Emp. Form.:
C17H15Cl2N5O
Mol. Mass.:
376.24
SMILES:
NCC(Nc1ncnc2c(cccc12)C(N)=O)c1ccc(Cl)c(Cl)c1
: