Target
Aurora kinase A
Ligand
BDBM116507
Substrate
Meas. Tech.
Enzyme Assay
IC50
48±n/a nM
Citation
 Sutton, AELan, RRichardson, TEPerrey, DVandeveer, HGHuck, BRKarra, SRChen, XXiao, YLiu-Bujalski, LGoutopoulos, AStieber, FHodous, BLQiu, HJones, RHeasley, BH Amino azaheterocyclic carboxamides US Patent  US8637532 Publication Date 1/28/2014 
Target
Name:
Aurora kinase A
Synonyms:
AIK ARK1 AURKA AYK1 Aurora kinase A (AURA) Aurora kinase A (Aurora A) Aurora-related kinase 1 BTAK Breast-tumor-amplified kinase STK15 Serine/threonine kinase 15 Serine/threonine-protein kinase aurora A hARK1
Type:
Serine/threonine-protein kinase
Mol. Mass.:
45830.98
Organism:
Homo sapiens (Human)
Description:
O14965
Residue:
403
  
Inhibitor
Name:
BDBM116507
Synonyms:
US8637532, 188
Type:
Small organic molecule
Emp. Form.:
C18H19N5O2
Mol. Mass.:
337.3758
SMILES:
COc1cc(C(N)=O)c2ncnc(N[C@H](CN)c3ccccc3)c2c1
: