Target
Aurora kinase B
Ligand
BDBM116556
Substrate
Meas. Tech.
Enzyme Assay
IC50
0.4±n/a nM
Citation
 Sutton, AELan, RRichardson, TEPerrey, DVandeveer, HGHuck, BRKarra, SRChen, XXiao, YLiu-Bujalski, LGoutopoulos, AStieber, FHodous, BLQiu, HJones, RHeasley, BH Amino azaheterocyclic carboxamides US Patent  US8637532 Publication Date 1/28/2014 
Target
Name:
Aurora kinase B
Synonyms:
AIK2 AIM1 ARK2 AURKB_HUMAN Aurora B-INCENP Aurora kinase B (AURKB) STK-1 STK12 Serine/threonine-protein kinase aurora B
Type:
Protein
Mol. Mass.:
39327.72
Organism:
Homo sapiens (Human)
Description:
Q96GD4
Residue:
344
  
Inhibitor
Name:
BDBM116556
Synonyms:
US8637532, 247
Type:
Small organic molecule
Emp. Form.:
C24H20FN5O3
Mol. Mass.:
445.4457
SMILES:
CC(Nc1ncnc2c(cccc12)C(N)=O)c1cccc(NC(=O)c2ccc(F)c(O)c2)c1
: