Target
Aurora kinase B
Ligand
BDBM116749
Substrate
Meas. Tech.
Enzyme Assay
IC50
5.3±n/a nM
Citation
 Sutton, AELan, RRichardson, TEPerrey, DVandeveer, HGHuck, BRKarra, SRChen, XXiao, YLiu-Bujalski, LGoutopoulos, AStieber, FHodous, BLQiu, HJones, RHeasley, BH Amino azaheterocyclic carboxamides US Patent  US8637532 Publication Date 1/28/2014 
Target
Name:
Aurora kinase B
Synonyms:
AIK2 AIM1 ARK2 AURKB_HUMAN Aurora B-INCENP Aurora kinase B (AURKB) STK-1 STK12 Serine/threonine-protein kinase aurora B
Type:
Protein
Mol. Mass.:
39327.72
Organism:
Homo sapiens (Human)
Description:
Q96GD4
Residue:
344
  
Inhibitor
Name:
BDBM116749
Synonyms:
US8637532, 462
Type:
Small organic molecule
Emp. Form.:
C27H24F3N5O4
Mol. Mass.:
539.5058
SMILES:
COCCC(Nc1ncnc2c(cccc12)C(N)=O)c1cccc(NC(=O)c2ccc(OC(F)(F)F)cc2)c1
: