Target
Aurora kinase B
Ligand
BDBM116989
Substrate
Meas. Tech.
Enzyme Assay
IC50
0.6±n/a nM
Citation
 Sutton, AELan, RRichardson, TEPerrey, DVandeveer, HGHuck, BRKarra, SRChen, XXiao, YLiu-Bujalski, LGoutopoulos, AStieber, FHodous, BLQiu, HJones, RHeasley, BH Amino azaheterocyclic carboxamides US Patent  US8637532 Publication Date 1/28/2014 
Target
Name:
Aurora kinase B
Synonyms:
AIK2 AIM1 ARK2 AURKB_HUMAN Aurora B-INCENP Aurora kinase B (AURKB) STK-1 STK12 Serine/threonine-protein kinase aurora B
Type:
Protein
Mol. Mass.:
39327.72
Organism:
Homo sapiens (Human)
Description:
Q96GD4
Residue:
344
  
Inhibitor
Name:
BDBM116989
Synonyms:
US8637532, 716
Type:
Small organic molecule
Emp. Form.:
C24H21N5O4
Mol. Mass.:
443.4546
SMILES:
COc1ccc(cc1)C(=O)Nc1cccc(CNc2ncnc3c(cc(O)cc23)C(N)=O)c1
: