Target
TGF-beta receptor type-1
Ligand
BDBM282826
Substrate
Meas. Tech.
Biological Assay
pH
7.4±n/a
Temperature
298.15±n/a K
IC50
1.000±n/a nM
Comments
extracted
Citation
 Kinsella, TGelman, MHong, HDarwish, ISSingh, RYu, JBorzilleri, RMVelaparthi, ULiu, PDarne, CRahaman, HWarrier, JS TGF-beta inhibitors US Patent  US9884868 Publication Date 2/6/2018 
Target
Name:
TGF-beta receptor type-1
Synonyms:
ALK-5 Activin A receptor type II-like protein kinase of 53kD SKR4 TGF-beta receptor type I TGFBR1 TGFR1_HUMAN Transforming growth factor-beta receptor type I
Type:
enzyme
Mol. Mass.:
55968.24
Organism:
Homo sapiens (Human)
Description:
P36897
Residue:
503
  
Inhibitor
Name:
BDBM282826
Synonyms:
6-(4-(3-chloro-4-fluorophenyl)-1-(2,2-difluoroethyl)- 1H-imidazol-5-yl)imidazo[1,2-b]pyridazine-3- carbonitrile US11352360, Example 33' | US9884868, Example 33'
Type:
Small organic molecule
Emp. Form.:
C18H10ClF3N6
Mol. Mass.:
402.76
SMILES:
FC(F)Cn1cnc(c1-c1ccc2ncc(C#N)n2n1)-c1ccc(F)c(Cl)c1
: