Target
TGF-beta receptor type-1
Ligand
BDBM282963
Substrate
Meas. Tech.
Biological Assay
pH
7.4±n/a
Temperature
298.15±n/a K
IC50
0.600±n/a nM
Comments
extracted
Citation
 Kinsella, TGelman, MHong, HDarwish, ISSingh, RYu, JBorzilleri, RMVelaparthi, ULiu, PDarne, CRahaman, HWarrier, JS TGF-beta inhibitors US Patent  US9884868 Publication Date 2/6/2018 
Target
Name:
TGF-beta receptor type-1
Synonyms:
ALK-5 Activin A receptor type II-like protein kinase of 53kD SKR4 TGF-beta receptor type I TGFBR1 TGFR1_HUMAN Transforming growth factor-beta receptor type I
Type:
enzyme
Mol. Mass.:
55968.24
Organism:
Homo sapiens (Human)
Description:
P36897
Residue:
503
  
Inhibitor
Name:
BDBM282963
Synonyms:
6-(1-(1-cyclopropylethyl)-4-(4-fluorophenyl)-1H- imidazol-5-yl)imidazo[1,2-a]pyridine-3-carboxamide US11352360, Example 167' | US9884868, Example 167'
Type:
Small organic molecule
Emp. Form.:
C22H20FN5O
Mol. Mass.:
389.4255
SMILES:
CC(C1CC1)n1cnc(c1-c1ccc2ncc(C(N)=O)n2c1)-c1ccc(F)cc1
: