Target
3-phosphoinositide-dependent protein kinase 1
Ligand
BDBM117046
Substrate
Meas. Tech.
Inhibition Assay
IC50
5±n/a nM
Citation
 Heinrich, TWucherer-Plietker, MBuchstaller, H 1H-pyrrolo[2,3 b]-pyridine derivatives US Patent  US8664236 Publication Date 3/4/2014 
Target
Name:
3-phosphoinositide-dependent protein kinase 1
Synonyms:
3-Phosphoinositide-Dependent Protein Kinase 1 (PDK1) 3-phosphoinositide-dependent protein kinase 1 3-phosphoinositide-dependent protein kinase 1 (PDK-1) Isoform 2 of 3-phosphoinositide-dependent protein kinase 1 PDPK1 Phosphoinositide-dependent protein kinase 1 (PDK1) hPDK1
Type:
Enzyme
Mol. Mass.:
63157.65
Organism:
Homo sapiens (Human)
Description:
O15530
Residue:
556
  
Inhibitor
Name:
BDBM117046
Synonyms:
US8664236, A26 | US9238651, A26
Type:
Small organic molecule
Emp. Form.:
C23H21FN8O
Mol. Mass.:
444.4642
SMILES:
Cn1cc(cn1)-c1cnc2[nH]cc(-c3cc(nc(N)n3)N(CCO)c3ccccc3F)c2c1
: