Target
15-hydroxyprostaglandin dehydrogenase [NAD(+)]
Ligand
BDBM118047
Substrate
Meas. Tech.
Inhibition Assay
pH
7.5±n/a
IC50
44.9±n/a nM
Comments
extracted
Citation
 Cho, HWu, YChoi, C Thiazolidinedione derivative and use thereof US Patent  US8637558 Publication Date 1/28/2014 
Target
Name:
15-hydroxyprostaglandin dehydrogenase [NAD(+)]
Synonyms:
15-PGDH HPGD PGDH_HUMAN SDR36C1
Type:
Enzyme
Mol. Mass.:
28974.46
Organism:
Homo sapiens (Human)
Description:
P15428
Residue:
266
  
Inhibitor
Name:
BDBM118047
Synonyms:
US8637558, 75
Type:
Small organic molecule
Emp. Form.:
C19H16ClNO3S
Mol. Mass.:
373.853
SMILES:
OC1=NC(=O)C(S1)=Cc1cccc(OCCCc2ccccc2)c1Cl
: