Target
Amine oxidase [flavin-containing] A
Ligand
BDBM118220
Substrate
Meas. Tech.
MAO-A and MAO-B Assays
pH
7.5±n/a
IC50
>130000±n/a nM
Comments
extracted
Citation
 Graupe, MVenkataramani, CZablocki, J ALDH-2 inhibitors in the treatment of addiction US Patent  US8673966 Publication Date 3/18/2014 
Target
Name:
Amine oxidase [flavin-containing] A
Synonyms:
AOFA_HUMAN MAO-A Monoamine oxidase Monoamine oxidase type A (MAO A) Monoamine oxidase type A (MAOA)
Type:
Protein
Mol. Mass.:
59689.53
Organism:
Homo sapiens (Human)
Description:
P21397
Residue:
527
  
Inhibitor
Name:
BDBM118220
Synonyms:
US8673966, N-(4-(7-((1-(3,3-difluorocyclobutanecarbonyl)- azetidin-3-yl)ethynyl)-4-oxo-4H-chromen-3-yl)phenyl)methanesulfonamide
Type:
Emp. Form.:
C26H22F2N2O5S
Mol. Mass.:
512.525
SMILES:
CS(=O)(=O)Nc1ccc(cc1)-c1coc2cc(ccc2c1=O)C#CC1CN(C1)C(=O)C1CC(F)(F)C1
: