Target
Amine oxidase [flavin-containing] B
Ligand
BDBM118233
Substrate
Meas. Tech.
MAO-A and MAO-B Assays
pH
7.5±n/a
IC50
>130000±n/a nM
Comments
extracted
Citation
 Graupe, MVenkataramani, CZablocki, J ALDH-2 inhibitors in the treatment of addiction US Patent  US8673966 Publication Date 3/18/2014 
Target
Name:
Amine oxidase [flavin-containing] B
Synonyms:
AOFB_HUMAN MAOB Monoamine oxidase type B (MAO B) Monoamine oxidase type B (MAOB)
Type:
Protein
Mol. Mass.:
58768.76
Organism:
Homo sapiens (Human)
Description:
P27338
Residue:
520
  
Inhibitor
Name:
BDBM118233
Synonyms:
US8673966, tert-butyl (1-(3-((3-(4-(methylsulfonamido)- phenyl)-4-oxo-4H-chromen-7-yl)ethynyl)azetidine-1-carbonyl)cyclopropyl)-methylcarbamate
Type:
Emp. Form.:
C31H33N3O7S
Mol. Mass.:
591.675
SMILES:
CN(C(=O)OC(C)(C)C)C1(CC1)C(=O)N1CC(C1)C#Cc1ccc2c(c1)occ(-c1ccc(NS(C)(=O)=O)cc1)c2=O
: