Target
Fibroblast growth factor receptor 1
Ligand
BDBM4604
Substrate
Poly(E:Y)
Meas. Tech.
Kinase Inhibition Assay
pH
7.4±n/a
Temperature
298.15±n/a K
IC50
17000±n/a nM
Citation
 Thompson, AMConnolly, CJHamby, JMBoushelle, SHartl, BGAmar, AMKraker, AJDriscoll, DLSteinkampf, RWPatmore, SJVincent, PWRoberts, BJElliott, WLKlohs, WLeopold, WRShowalter, HDDenny, WA 3-(3,5-Dimethoxyphenyl)-1,6-naphthyridine-2,7-diamines and related 2-urea derivatives are potent and selective inhibitors of the FGF receptor-1 tyrosine kinase. J Med Chem 43:4200-11 (2000)  
Target
Name:
Fibroblast growth factor receptor 1
Synonyms:
BFGFR Basic fibroblast growth factor receptor 1 (FGFR1) CEK FGFR-1 FGFR-1, (FL) FGFR1_HUMAN FLT2 Fibroblast growth factor receptor 1 (FGFR-1) Fms-like tyrosine kinase 2 N-sam bFGF-R | c-fgr
Type:
Receptor
Mol. Mass.:
91861.70
Organism:
Homo sapiens (Human)
Description:
P11362
Residue:
822
  
Inhibitor
Name:
BDBM4604
Synonyms:
1,6-naphthyridine deriv. 6 | 3-phenyl-1,6-naphthyridine-2,7-diamine
Type:
Small organic molecule
Emp. Form.:
C14H12N4
Mol. Mass.:
236.2719
SMILES:
Nc1cc2nc(N)c(cc2cn1)-c1ccccc1
:
Substrate
Name:
Poly(E:Y)
Synonyms:
Type:
Random polymer
Mol. Mass.:
358.43
Organism:
Description:
Random copolymer of glutamic acid and tyrosine (4:1). 50 uM ATP containing 0.4 uCi of [gamma-32P]ATP as co-substrate
Residue:
3
NA