Target
UDP-N-acetylglucosamine 1-carboxyvinyltransferase
Ligand
BDBM119080
Substrate
IC50
4.6e+3±n/a nM
Citation
 Hrast, MSosic, ISink, RGobec, S Inhibitors of the peptidoglycan biosynthesis enzymes MurA-F. Bioorg Chem 55:2-15 (2014)  
Target
Name:
UDP-N-acetylglucosamine 1-carboxyvinyltransferase
Synonyms:
EPT MURA_ECOLI UDP-N-acetylglucosamine 1-carboxyvinyltransferase murA | murZ
Type:
Protein
Mol. Mass.:
44814.62
Organism:
Escherichia coli K-12 (Enterobacteria)
Description:
E. coli MurA
Residue:
419
  
Inhibitor
Name:
BDBM119080
Synonyms:
MurB inhibitor (compound 19)
Type:
Small organic molecule
Emp. Form.:
C10H6Cl2N4O3S
Mol. Mass.:
333.151
SMILES:
[O-][N+](=O)c1cnc(NC(=O)Nc2ccc(Cl)c(Cl)c2)s1
: