Target
UDP-N-acetylmuramate--L-alanine ligase
Ligand
BDBM119087
Substrate
IC50
1.23e+5±n/a nM
Citation
 Hrast, MSosic, ISink, RGobec, S Inhibitors of the peptidoglycan biosynthesis enzymes MurA-F. Bioorg Chem 55:2-15 (2014)  
Target
Name:
UDP-N-acetylmuramate--L-alanine ligase
Synonyms:
MURC_ECOLI UDP-N-acetylmuramate--L-alanine ligase | murC
Type:
Protein
Mol. Mass.:
53617.78
Organism:
Escherichia coli
Description:
P17952
Residue:
491
  
Inhibitor
Name:
BDBM119087
Synonyms:
MurC/D inhibitor (compound 26)
Type:
Small organic molecule
Emp. Form.:
C15H12N4O4
Mol. Mass.:
312.2802
SMILES:
Oc1ccc(C=NNC(=O)c2[nH]nc3ccccc23)c(O)c1O
: