Target
UDP-N-acetylmuramoyl-tripeptide--D-alanyl-D-alanine ligase
Ligand
BDBM119115
Substrate
IC50
420±0.0 nM
Citation
 Hrast, MSosic, ISink, RGobec, S Inhibitors of the peptidoglycan biosynthesis enzymes MurA-F. Bioorg Chem 55:2-15 (2014)  
Target
Name:
UDP-N-acetylmuramoyl-tripeptide--D-alanyl-D-alanine ligase
Synonyms:
MurF (S. pneumoniae) UDP-N-acetylmuramoylalanine-D-glutamyl-lysine-D-alanyl-D-alanine ligase
Type:
Protein
Mol. Mass.:
50482.72
Organism:
Streptococcus pneumoniae (Firmicutes)
Description:
S. pneumoniae MurF
Residue:
457
  
Inhibitor
Name:
BDBM119115
Synonyms:
MurF inhibitor (compound 57)
Type:
Small organic molecule
Emp. Form.:
C26H26Cl2N4O5S2
Mol. Mass.:
609.544
SMILES:
Oc1cccc(CN2CCC3C(C2)SC(NC(=O)c2cc(c(Cl)cc2Cl)S(=O)(=O)N2CCOCC2)=C3C#N)c1
: