Target
UDP-N-acetylmuramoyl-tripeptide--D-alanyl-D-alanine ligase
Ligand
BDBM119115
Substrate
IC50
8.1e+4±n/a nM
Citation
 Hrast, MSosic, ISink, RGobec, S Inhibitors of the peptidoglycan biosynthesis enzymes MurA-F. Bioorg Chem 55:2-15 (2014)  
Target
Name:
UDP-N-acetylmuramoyl-tripeptide--D-alanyl-D-alanine ligase
Synonyms:
MURF_ECOLI mra | murF
Type:
Protein
Mol. Mass.:
47439.03
Organism:
Escherichia coli
Description:
P11880
Residue:
452
  
Inhibitor
Name:
BDBM119115
Synonyms:
MurF inhibitor (compound 57)
Type:
Small organic molecule
Emp. Form.:
C26H26Cl2N4O5S2
Mol. Mass.:
609.544
SMILES:
Oc1cccc(CN2CCC3C(C2)SC(NC(=O)c2cc(c(Cl)cc2Cl)S(=O)(=O)N2CCOCC2)=C3C#N)c1
: