Target
UDP-N-acetylmuramoyl-tripeptide--D-alanyl-D-alanine ligase
Ligand
BDBM119119
Substrate
IC50
2.5e+3±n/a nM
Citation
 Hrast, MSosic, ISink, RGobec, S Inhibitors of the peptidoglycan biosynthesis enzymes MurA-F. Bioorg Chem 55:2-15 (2014)  
Target
Name:
UDP-N-acetylmuramoyl-tripeptide--D-alanyl-D-alanine ligase
Synonyms:
MURF_ECOLI mra | murF
Type:
Protein
Mol. Mass.:
47439.03
Organism:
Escherichia coli
Description:
P11880
Residue:
452
  
Inhibitor
Name:
BDBM119119
Synonyms:
MurF inhibitor (compound 61)
Type:
Small organic molecule
Emp. Form.:
C23H15F6N7OS
Mol. Mass.:
551.467
SMILES:
NC(=N)c1ccc(NC(=O)c2cnc(Nc3nc(cs3)-c3cccc(c3)C(F)(F)F)nc2C(F)(F)F)cc1
: