Target
Bifunctional purine biosynthesis protein ATIC
Ligand
BDBM24692
Substrate
Meas. Tech.
Enzyme Activity Assays
Ki
2.0e+4±n/a nM
Citation
 Connelly, SDeMartino, JKBoger, DLWilson, IA Biological and structural evaluation of 10R- and 10S-methylthio-DDACTHF reveals a new role for sulfur in inhibition of glycinamide ribonucleotide transformylase. Biochemistry 52:5133-44 (2013)  
Target
Name:
Bifunctional purine biosynthesis protein ATIC
Synonyms:
5-aminoimidazole-4-carboxamide ribonucleotide formyltransferase AICAR Tfase ATIC Bifunctional purine biosynthesis protein PURH IMP cyclohydrolase Inosinicase PURH Thymidylate synthase/GAR transformylase/AICAR transformylase
Type:
Protein
Mol. Mass.:
64616.62
Organism:
Homo sapiens (Human)
Description:
P31939
Residue:
592
  
Inhibitor
Name:
BDBM24692
Synonyms:
2-({4-[4-(2,4-diamino-6-oxo-1,6-dihydropyrimidin-5-yl)butyl]phenyl}formamido)pentanedioic acid | DDACTHF
Type:
Small organic molecule
Emp. Form.:
C20H25N5O6
Mol. Mass.:
431.4424
SMILES:
Nc1nc(N)c(CCCCc2ccc(cc2)C(=O)NC(CCC(O)=O)C(O)=O)c(=O)[nH]1
: