Target
Trace amine-associated receptor 1
Ligand
BDBM119156
Substrate
Meas. Tech.
Radioligand Binding Assay
Ki
0.3±n/a nM
Citation
 Nettekoven, MNorcross, RPolara, A Dihydrooxazol-2-amine derivatives US Patent  US8673950 Publication Date 3/18/2014 
Target
Name:
Trace amine-associated receptor 1
Synonyms:
TAAR1_MOUSE Taar1 Trace amine receptor 1 (TARR1) Trace amine-associated receptor1 | Trar1
Type:
Protein
Mol. Mass.:
37635.41
Organism:
Mus musculus (Mouse)
Description:
Q923Y8
Residue:
332
  
Inhibitor
Name:
BDBM119156
Synonyms:
US8673950, 23
Type:
Small organic molecule
Emp. Form.:
C17H17F3N4O
Mol. Mass.:
350.3383
SMILES:
NC1=N[C@@H](CCc2ccc(Nc3cc(ccn3)C(F)(F)F)cc2)CO1
: