Target
Bromodomain-containing protein 4
Ligand
BDBM283110
Substrate
Meas. Tech.
Bromodomain Binding Assay
IC50
220±n/a nM
Citation
 Oh, SChoi, M Bromodomain-inhibiting compounds and pharmaceutical composition comprising same for preventing or treating a cancer US Patent  US9884874 Publication Date 2/6/2018 
Target
Name:
Bromodomain-containing protein 4
Synonyms:
BRD4 Bromodomain-containing protein 4 (BRD4) Protein HUNK1
Type:
Protein
Mol. Mass.:
152264.84
Organism:
Homo sapiens (Human)
Description:
O60885
Residue:
1362
  
Inhibitor
Name:
BDBM283110
Synonyms:
(R)-(6-(4-chlorophenyl)-8-methoxy-1-methyl-4H-benzo[f][1,2,4]triazolo[4,3-a][1,4]diazepin-4-yl)methyl ethanesulfonate | US9884874, Compound 2
Type:
Small organic molecule
Emp. Form.:
C21H21ClN4O4S
Mol. Mass.:
460.934
SMILES:
CCS(=O)(=O)OC[C@@H]1N=C(c2ccc(Cl)cc2)c2cc(OC)ccc2-n2c(C)nnc12
: