Target
Bromodomain-containing protein 4
Ligand
BDBM283118
Substrate
Meas. Tech.
Bromodomain Binding Assay
IC50
280±n/a nM
Citation
 Oh, SChoi, M Bromodomain-inhibiting compounds and pharmaceutical composition comprising same for preventing or treating a cancer US Patent  US9884874 Publication Date 2/6/2018 
Target
Name:
Bromodomain-containing protein 4
Synonyms:
BRD4 Bromodomain-containing protein 4 (BRD4) Protein HUNK1
Type:
Protein
Mol. Mass.:
152264.84
Organism:
Homo sapiens (Human)
Description:
O60885
Residue:
1362
  
Inhibitor
Name:
BDBM283118
Synonyms:
(R)-(6-(4-chlorophenyl)-8-methoxy-1-methyl-4H-benzo[f][1,2,4]triazolo[4,3-a][1,4]diazepin-4-yl)methyl dimethylsulfamate | US9884874, Compound 9
Type:
Small organic molecule
Emp. Form.:
C21H22ClN5O4S
Mol. Mass.:
475.948
SMILES:
COc1ccc-2c(c1)C(=N[C@@H](COS(=O)(=O)N(C)C)c1nnc(C)n-21)c1ccc(Cl)cc1
: