Target
Sodium/glucose cotransporter 2
Ligand
BDBM119379
Substrate
Meas. Tech.
Biological Assays
IC50
3±n/a nM
Citation
 Mascitti, V Dioxa-bicyclo[3.2.1]octane-2,3,4-triol derivatives US Patent  US8669380 Publication Date 3/11/2014 
Target
Name:
Sodium/glucose cotransporter 2
Synonyms:
Na(+)/glucose cotransporter 2 SGLT2 Sodium-Dependent Glucose Cotransporter 2 (SGLT2) Solute carrier family 5 member 2
Type:
Protein
Mol. Mass.:
72902.00
Organism:
Homo sapiens (Human)
Description:
P31639
Residue:
672
  
Inhibitor
Name:
BDBM119379
Synonyms:
US8669380, 8
Type:
Small organic molecule
Emp. Form.:
C22H24ClFO6
Mol. Mass.:
438.874
SMILES:
CCOc1ccc(Cc2cc(ccc2Cl)[C@]23OC[C@](CF)(O2)[C@@H](O)[C@H](O)[C@H]3O)cc1
: