Target
Prostaglandin E2 receptor EP4 subtype
Ligand
BDBM119445
Substrate
Meas. Tech.
Radioligand Binding Assay:
pH
7.4±n/a
Ki
43±n/a nM
Citation
 Spyvee, MSatoh, TCarlson, JE Pharmaceutical composition US Patent  US8686018 Publication Date 4/1/2014 
Target
Name:
Prostaglandin E2 receptor EP4 subtype
Synonyms:
PE2R4_HUMAN PGE2 receptor EP4 subtype PTGER4 Prostanoid EP4 receptor
Type:
Enzyme
Mol. Mass.:
53134.53
Organism:
Homo sapiens (Human)
Description:
P35408
Residue:
488
  
Inhibitor
Name:
BDBM119445
Synonyms:
US8686018, 104
Type:
Small organic molecule
Emp. Form.:
C23H20F3N3O4
Mol. Mass.:
459.4178
SMILES:
Cc1nn(C)c(Oc2cccc(c2)C(F)(F)F)c1C(=O)NC1(CC1)c1ccc(cc1)C(O)=O
: