Target
Vascular endothelial growth factor receptor 1
Ligand
BDBM4622
Substrate
poly(E,A,Y)
Meas. Tech.
VEGF-R Kinase Inhibition Assay
pH
7.4±n/a
Temperature
295.15±n/a K
IC50
200±n/a nM
Citation
 Hennequin, LFThomas, APJohnstone, CStokes, ESPlé, PALohmann, JJOgilvie, DJDukes, MWedge, SRCurwen, JOKendrew, JLambert-van der Brempt, C Design and structure-activity relationship of a new class of potent VEGF receptor tyrosine kinase inhibitors. J Med Chem 42:5369-89 (1999)  
Target
Name:
Vascular endothelial growth factor receptor 1
Synonyms:
FLT FRT Fms-like tyrosine kinase 1 Tyrosine-protein kinase FRT VEGFR-1 VGFR1_HUMAN Vascular endothelial growth factor receptor 1 (FLT1) Vascular endothelial growth factor receptor 1 and 2 (Flt-1 and KDR) Vascular permeability factor receptor vascular endothelial growth factor/vascular permeability factor receptor
Type:
Receptor Tyrosine Kinase
Mol. Mass.:
150800.23
Organism:
Homo sapiens (Human)
Description:
P17948
Residue:
1338
  
Inhibitor
Name:
BDBM4622
Synonyms:
3-[(6,7-dimethoxyquinazolin-4-yl)amino]phenol CHEMBL127907
Type:
Small organic molecule
Emp. Form.:
C16H15N3O3
Mol. Mass.:
297.3086
SMILES:
COc1cc2ncnc(Nc3cccc(O)c3)c2cc1OC
:
Substrate
Name:
poly(E,A,Y)
Synonyms:
Type:
Random Copolymer
Mol. Mass.:
358.43
Organism:
Description:
A poly(glu, ala, tyr) 6:3:1 random copolymer. 2 uM ATP was used as co-substrate.
Residue:
3
NA