Target
cGMP-dependent 3',5'-cyclic phosphodiesterase
Ligand
BDBM119687
Substrate
Meas. Tech.
Inhibition Assay
Ki
110±n/a nM
Citation
 DeLeon, PEgbertson, MHills, IDJohnson, AWMachacek, M Quinolinone PDE2 inhibitors US Patent  US8680116 Publication Date 3/25/2014 
Target
Name:
cGMP-dependent 3',5'-cyclic phosphodiesterase
Synonyms:
CGS-PDE Homo sapiens phosphodiesterase 2A (PDE2A) PDE2A cGSPDE
Type:
Enzyme Catalytic Domain
Mol. Mass.:
105691.58
Organism:
Homo sapiens (Human)
Description:
O00408
Residue:
941
  
Inhibitor
Name:
BDBM119687
Synonyms:
US8680116, 1-85
Type:
Small organic molecule
Emp. Form.:
C26H25NO3S
Mol. Mass.:
431.547
SMILES:
COc1cc2[nH]c(=O)c(-c3cccs3)c(-c3cccc(c3)C3CCCC3)c2cc1OC
: