Target
Histone deacetylase 7
Ligand
BDBM119703
Substrate
Meas. Tech.
Enzyme Assay
Temperature
303.15±n/a K
IC50
290±n/a nM
Comments
extracted
Citation
 Cossío Mora, FPZubia Olascoaga, AVara Salazar, YSan Sebastián Larzabal, EIOtaegui Ansa, DMasdeu Margalef, MAldaba Arévalo, E Histone deacetylase inhibitors based simultaneously on trisubstituted 1H-pyrroles and aromatic and heteroaromatic spacers US Patent  US8685992 Publication Date 4/1/2014 
Target
Name:
Histone deacetylase 7
Synonyms:
HD7 HDAC7A Histone acetylase 7 (HDAC7) Human HDAC7
Type:
Chromatin regulator; hydrolase; repressor
Mol. Mass.:
102942.62
Organism:
Homo sapiens (Human)
Description:
Q8WUI4
Residue:
952
  
Inhibitor
Name:
BDBM119703
Synonyms:
US8685992, 27
Type:
Small organic molecule
Emp. Form.:
C24H21N3O5
Mol. Mass.:
431.4406
SMILES:
COc1ccc(cc1)-c1cc(-c2ccoc2)c([nH]1)C(=O)NCc1ccc(cc1)C(=O)NO
: