Target
Arachidonate 5-lipoxygenase-activating protein
Ligand
BDBM47234
Substrate
Meas. Tech.
Binding Assay
Ki
1.000±n/a nM
Citation
 Bacani, GMEccles, WFitzgerald, AEGoldberg, SDHack, MDHawryluk, NAJones, WMKeith, JMKrawczuk, PLebsack, ADLee-Dutra, ALiu, JMcClure, KJMeduna, SPPippel, DJRosen, MDSales, ZS FLAP modulators US Patent  US9884878 Publication Date 2/6/2018 
Target
Name:
Arachidonate 5-lipoxygenase-activating protein
Synonyms:
5-lipoxygenase activating protein 5-lipoxygenase/FLAP ALOX5AP MK-886-binding protein
Type:
Enzyme
Mol. Mass.:
18159.90
Organism:
Homo sapiens (Human)
Description:
P20292
Residue:
161
  
Inhibitor
Name:
BDBM47234
Synonyms:
US9079866, 117 US9884878, Compound 117
Type:
Emp. Form.:
C24H21FN4O3S
Mol. Mass.:
464.512
SMILES:
Nc1cnc(cn1)-c1ccc(cc1F)-c1ccccc1S(=O)(=O)NC[C@H](O)c1ccccc1
: