Target
Arachidonate 5-lipoxygenase-activating protein
Ligand
BDBM283245
Substrate
Meas. Tech.
Binding Assay
Ki
<0.1±n/a nM
Citation
 Bacani, GMEccles, WFitzgerald, AEGoldberg, SDHack, MDHawryluk, NAJones, WMKeith, JMKrawczuk, PLebsack, ADLee-Dutra, ALiu, JMcClure, KJMeduna, SPPippel, DJRosen, MDSales, ZS FLAP modulators US Patent  US9884878 Publication Date 2/6/2018 
Target
Name:
Arachidonate 5-lipoxygenase-activating protein
Synonyms:
5-lipoxygenase activating protein 5-lipoxygenase/FLAP ALOX5AP MK-886-binding protein
Type:
Enzyme
Mol. Mass.:
18159.90
Organism:
Homo sapiens (Human)
Description:
P20292
Residue:
161
  
Inhibitor
Name:
BDBM283245
Synonyms:
4'-(5-aminopyrazin-2-yl)-3'-fluoro-N-((1S,2S)- 1-hydroxy-1-phenylpropan-2-yl)-N-methyl- [1,1'-biphenyl]-2-sulfonamide US9884878, Compound 118
Type:
Small organic molecule
Emp. Form.:
C26H25FN4O3S
Mol. Mass.:
492.565
SMILES:
C[C@@H]([C@@H](O)c1ccccc1)N(C)S(=O)(=O)c1ccccc1-c1ccc(c(F)c1)-c1cnc(N)cn1
: