Target
Arachidonate 5-lipoxygenase-activating protein
Ligand
BDBM283304
Substrate
Meas. Tech.
Binding Assay
Ki
<0.1±n/a nM
Citation
 Bacani, GMEccles, WFitzgerald, AEGoldberg, SDHack, MDHawryluk, NAJones, WMKeith, JMKrawczuk, PLebsack, ADLee-Dutra, ALiu, JMcClure, KJMeduna, SPPippel, DJRosen, MDSales, ZS FLAP modulators US Patent  US9884878 Publication Date 2/6/2018 
Target
Name:
Arachidonate 5-lipoxygenase-activating protein
Synonyms:
5-lipoxygenase activating protein 5-lipoxygenase/FLAP ALOX5AP MK-886-binding protein
Type:
Enzyme
Mol. Mass.:
18159.90
Organism:
Homo sapiens (Human)
Description:
P20292
Residue:
161
  
Inhibitor
Name:
BDBM283304
Synonyms:
5-{3-Fluoro-2'-[(4-pyrimidin-2-ylpiperazin-1- yl)sulfonyl]biphenyl-4-yl}pyrazin-2-amine US9884878, Compound 177
Type:
Small organic molecule
Emp. Form.:
C24H22FN7O2S
Mol. Mass.:
491.541
SMILES:
Nc1cnc(cn1)-c1ccc(cc1F)-c1ccccc1S(=O)(=O)N1CCN(CC1)c1ncccn1
: