Target
Arachidonate 5-lipoxygenase-activating protein
Ligand
BDBM168978
Substrate
Meas. Tech.
Binding Assay
Ki
1.000±n/a nM
Citation
 Bacani, GMEccles, WFitzgerald, AEGoldberg, SDHack, MDHawryluk, NAJones, WMKeith, JMKrawczuk, PLebsack, ADLee-Dutra, ALiu, JMcClure, KJMeduna, SPPippel, DJRosen, MDSales, ZS FLAP modulators US Patent  US9884878 Publication Date 2/6/2018 
Target
Name:
Arachidonate 5-lipoxygenase-activating protein
Synonyms:
5-lipoxygenase activating protein 5-lipoxygenase/FLAP ALOX5AP MK-886-binding protein
Type:
Enzyme
Mol. Mass.:
18159.90
Organism:
Homo sapiens (Human)
Description:
P20292
Residue:
161
  
Inhibitor
Name:
BDBM168978
Synonyms:
US9079866, 379 US9884878, Compound 379
Type:
Small organic molecule
Emp. Form.:
C19H15FN4O2S
Mol. Mass.:
382.411
SMILES:
CNS(=O)(=O)c1ccccc1-c1ccc(c(F)c1)-c1cnc2[nH]ccc2n1
: