Target
Arachidonate 5-lipoxygenase-activating protein
Ligand
BDBM283516
Substrate
Meas. Tech.
Binding Assay
Ki
<0.1±n/a nM
Citation
 Bacani, GMEccles, WFitzgerald, AEGoldberg, SDHack, MDHawryluk, NAJones, WMKeith, JMKrawczuk, PLebsack, ADLee-Dutra, ALiu, JMcClure, KJMeduna, SPPippel, DJRosen, MDSales, ZS FLAP modulators US Patent  US9884878 Publication Date 2/6/2018 
Target
Name:
Arachidonate 5-lipoxygenase-activating protein
Synonyms:
5-lipoxygenase activating protein 5-lipoxygenase/FLAP ALOX5AP MK-886-binding protein
Type:
Enzyme
Mol. Mass.:
18159.90
Organism:
Homo sapiens (Human)
Description:
P20292
Residue:
161
  
Inhibitor
Name:
BDBM283516
Synonyms:
4'-(3,4-Dihydro-2H-pyrido[3,2-b][1,4]oxazin-7- yl)-3'-fluoro-N-[(1R)-2-hydroxy-1- methylethyl]biphenyl-2-sulfonamide US9884878, Compound 390
Type:
Small organic molecule
Emp. Form.:
C22H22FN3O4S
Mol. Mass.:
443.491
SMILES:
C[C@H](CO)NS(=O)(=O)c1ccccc1-c1ccc(c(F)c1)-c1cnc2NCCOc2c1
: