Target
Arachidonate 5-lipoxygenase-activating protein
Ligand
BDBM169405
Substrate
Meas. Tech.
Binding Assay
Ki
0.600±n/a nM
Citation
 Bacani, GMEccles, WFitzgerald, AEGoldberg, SDHack, MDHawryluk, NAJones, WMKeith, JMKrawczuk, PLebsack, ADLee-Dutra, ALiu, JMcClure, KJMeduna, SPPippel, DJRosen, MDSales, ZS FLAP modulators US Patent  US9884878 Publication Date 2/6/2018 
Target
Name:
Arachidonate 5-lipoxygenase-activating protein
Synonyms:
5-lipoxygenase activating protein 5-lipoxygenase/FLAP ALOX5AP MK-886-binding protein
Type:
Enzyme
Mol. Mass.:
18159.90
Organism:
Homo sapiens (Human)
Description:
P20292
Residue:
161
  
Inhibitor
Name:
BDBM169405
Synonyms:
US9079866, 810 US9884878, Compound 810
Type:
Small organic molecule
Emp. Form.:
C20H19FN4O2S
Mol. Mass.:
398.454
SMILES:
Nc1cnc(cn1)-c1ccc(cc1F)-c1cccnc1S(=O)(=O)C1CCCC1
: