Target
Arachidonate 5-lipoxygenase-activating protein
Ligand
BDBM169421
Substrate
Meas. Tech.
Binding Assay
Ki
0.700±n/a nM
Citation
 Bacani, GMEccles, WFitzgerald, AEGoldberg, SDHack, MDHawryluk, NAJones, WMKeith, JMKrawczuk, PLebsack, ADLee-Dutra, ALiu, JMcClure, KJMeduna, SPPippel, DJRosen, MDSales, ZS FLAP modulators US Patent  US9884878 Publication Date 2/6/2018 
Target
Name:
Arachidonate 5-lipoxygenase-activating protein
Synonyms:
5-lipoxygenase activating protein 5-lipoxygenase/FLAP ALOX5AP MK-886-binding protein
Type:
Enzyme
Mol. Mass.:
18159.90
Organism:
Homo sapiens (Human)
Description:
P20292
Residue:
161
  
Inhibitor
Name:
BDBM169421
Synonyms:
US9079866, 826 US9884878, Compound 826
Type:
Small organic molecule
Emp. Form.:
C21H18FN3O2S
Mol. Mass.:
395.45
SMILES:
CC(C)S(=O)(=O)c1ncccc1-c1ccc(c(F)c1)-c1cnc2[nH]ccc2c1
: