Target
Neuronal acetylcholine receptor subunit alpha-7
Ligand
BDBM119804
Substrate
Meas. Tech.
Binding Assay
pH
7.4±0
Temperature
273.15±n/a K
Ki
<1±0.0 nM
Citation
 Flessner, TBöss, FHafner, FLuithle, JMethfessel, CTelan, L N-biarylamides US Patent  US8691840 Publication Date 4/8/2014 
Target
Name:
Neuronal acetylcholine receptor subunit alpha-7
Synonyms:
ACHA7_RAT Cholinergic, Nicotinic Alpha7 Chrna7 Neuronal acetylcholine receptor (alpha7 nAChR) Neuronal acetylcholine receptor subunit alpha-7 Neuronal acetylcholine receptor subunit alpha-7 (nAChR)
Type:
Enzyme
Mol. Mass.:
56502.44
Organism:
Rattus norvegicus (Rat)
Description:
Q05941
Residue:
502
  
Inhibitor
Name:
BDBM119804
Synonyms:
US8691840, 7
Type:
Small organic molecule
Emp. Form.:
C20H23N3O3S
Mol. Mass.:
385.48
SMILES:
NS(=O)(=O)c1ccc(cc1)-c1ccc(NC(=O)[C@H]2CN3CCC2CC3)cc1
: