Target
Dihydroorotate dehydrogenase (quinone), mitochondrial
Ligand
BDBM119811
Substrate
Meas. Tech.
Inhibition Assay
pH
8±n/a
IC50
19±n/a nM
Citation
 Castro Palomino Laria, JCErra Sola, MLozoya Toribio, MENavarro Romero, E Amino nicotinic and isonicotinic acid derivatives as DHODH inhibitors US Patent  US8691852 Publication Date 4/8/2014 
Target
Name:
Dihydroorotate dehydrogenase (quinone), mitochondrial
Synonyms:
DHODH Dihydroorotate dehydrogenase Dihydroorotate dehydrogenase, mitochondrial Dihydroorotate oxidase (DHODH) | PYRD_HUMAN
Type:
Enzyme
Mol. Mass.:
42881.33
Organism:
Homo sapiens (Human)
Description:
Q02127
Residue:
395
  
Inhibitor
Name:
BDBM119811
Synonyms:
US8691852, 19
Type:
Small organic molecule
Emp. Form.:
C20H16F2N2O3
Mol. Mass.:
370.3494
SMILES:
CCOc1cccc(c1)-c1cc(F)c(Nc2ncccc2C(O)=O)c(F)c1
: