Target
Dihydroorotate dehydrogenase (quinone), mitochondrial
Ligand
BDBM119829
Substrate
Meas. Tech.
Inhibition Assay
pH
8±n/a
IC50
4±n/a nM
Citation
 Castro Palomino Laria, JCErra Sola, MLozoya Toribio, MENavarro Romero, E Amino nicotinic and isonicotinic acid derivatives as DHODH inhibitors US Patent  US8691852 Publication Date 4/8/2014 
Target
Name:
Dihydroorotate dehydrogenase (quinone), mitochondrial
Synonyms:
DHODH Dihydroorotate dehydrogenase Dihydroorotate dehydrogenase, mitochondrial Dihydroorotate oxidase (DHODH) | PYRD_HUMAN
Type:
Enzyme
Mol. Mass.:
42881.33
Organism:
Homo sapiens (Human)
Description:
Q02127
Residue:
395
  
Inhibitor
Name:
BDBM119829
Synonyms:
US8691852, 57
Type:
Small organic molecule
Emp. Form.:
C19H13ClF2N2O2
Mol. Mass.:
374.769
SMILES:
Cc1c(F)c(Nc2ncccc2C(O)=O)c(F)cc1-c1ccccc1Cl
: