Target
cAMP and cAMP-inhibited cGMP 3',5'-cyclic phosphodiesterase 10A
Ligand
BDBM119847
Substrate
Meas. Tech.
IMAP TR-FRET Assay
pH
7.2±n/a
Temperature
298.15±n/a K
IC50
1.7±n/a nM
Citation
 Allen, JRChen, JJFrohn, MJKaller, MRLiu, QNguyen, TTPickrell, AJQian, WRzasa, RMZhong, W Azetidine and piperidine compounds useful as PDE10 inhibitors US Patent  US8691986 Publication Date 4/8/2014 
Target
Name:
cAMP and cAMP-inhibited cGMP 3',5'-cyclic phosphodiesterase 10A
Synonyms:
3',5'-cyclic phosphodiesterase PDE10_HUMAN Phosphodiesterase 10A
Type:
Protein
Mol. Mass.:
88412.52
Organism:
Homo sapiens (Human)
Description:
Q9Y233
Residue:
779
  
Inhibitor
Name:
BDBM119847
Synonyms:
US8691986, 13
Type:
Small organic molecule
Emp. Form.:
C24H19F2N5O
Mol. Mass.:
431.4374
SMILES:
CNC(=O)c1ccc(cc1F)-c1nccnc1C1CN(C1)c1ccc2cc(F)ccc2n1
: