Target
DNA primase
Ligand
BDBM50364890
Substrate
Meas. Tech.
Quatitative Inhibition Analysis Assay
pH
8.8±n/a
IC50
7.1e+3± 7e+2 nM
Comments
extracted
Citation
 Biswas, TGreen, KDGarneau-Tsodikova, STsodikov, OV Discovery of inhibitors of Bacillus anthracis primase DnaG. Biochemistry 52:6905-10 (2013)  
Target
Name:
DNA primase
Synonyms:
DNA primase (Ba DnaG)
Type:
Protein
Mol. Mass.:
68258.37
Organism:
Bacillus anthracis (Firmicutes)
Description:
A0A6L8PXB3
Residue:
598
  
Inhibitor
Name:
BDBM50364890
Synonyms:
Amixin IC cid_5475
Type:
Small organic molecule
Emp. Form.:
C25H34N2O3
Mol. Mass.:
410.5491
SMILES:
CCN(CC)CCOc1ccc2-c3ccc(OCCN(CC)CC)cc3C(=O)c2c1
: