Target
Fatty acid-binding protein, liver
Ligand
BDBM28700
Substrate
Meas. Tech.
ANS Fluorescence Displacement Assay
Ki
5.8e+3± 5e+2 nM
Citation
 Martin, GGMcIntosh, ALHuang, HGupta, SAtshaves, BPLandrock, KKLandrock, DKier, ABSchroeder, F The human liver fatty acid binding protein T94A variant alters the structure, stability, and interaction with fibrates. Biochemistry 52:9347-57 (2013)  
Target
Name:
Fatty acid-binding protein, liver
Synonyms:
FABPL_RAT Fatty acid-binding protein, liver | Liver fatty acid binding protein (rat L-FABP)
Type:
Protein
Mol. Mass.:
14274.39
Organism:
Rattus norvegicus (Rat)
Description:
rat L-FABP
Residue:
127
  
Inhibitor
Name:
BDBM28700
Synonyms:
2-(4-(4-Chlorobenzoyl)phenoxy)-2-methylpropionic acid CHEMBL981 FIBRICOR LF 153 procetofenic acid
Type:
Small organic molecule
Emp. Form.:
C17H15ClO4
Mol. Mass.:
318.752
SMILES:
CC(C)(Oc1ccc(cc1)C(=O)c1ccc(Cl)cc1)C(O)=O
: