Target
N-lysine methyltransferase SMYD2
Ligand
BDBM283211
Substrate
Meas. Tech.
Scintillation Proximity Assay (SPA) for Detection of SMYD2 Enzymatic Inhibition
pH
9±n/a
IC50
2400±n/a nM
Comments
extracted
Citation
 Mowat, JSStellfeld, TStresemann, CHillig, RKöhr, SStöckigt, DWeiske, JBrumby, TBarak, NChrist, CTer Laak, ABadock, VCrampton, RHStefanuti, I Aryl-cyanoguanidine compounds US Patent  US10023539 Publication Date 7/17/2018 
Target
Name:
N-lysine methyltransferase SMYD2
Synonyms:
HSKM-B KMT3C N-lysine methyltransferase SMYD2 SET and MYND domain-containing protein 2 (SMYD2) SMYD2_HUMAN
Type:
Enzyme
Mol. Mass.:
49689.57
Organism:
Homo sapiens (Human)
Description:
Q9NRG4
Residue:
433
  
Inhibitor
Name:
BDBM283211
Synonyms:
N-[1-{N′-cyano-N-[3-(trifluoromethoxy)phenyl]carbamimidoyl}-3-(3,4-dichlorophenyl)-4,5-dihydro-1H-pyrazol-4-yl]-N-ethyl-D-leucinamide | US10023539, Example 39
Type:
Small organic molecule
Emp. Form.:
C26H28Cl2F3N7O2
Mol. Mass.:
598.447
SMILES:
CCN(C1CN(N=C1c1ccc(Cl)c(Cl)c1)C(\Nc1cccc(OC(F)(F)F)c1)=N/C#N)C(=O)[C@H](N)CC(C)C
: