Target
Rho-associated protein kinase 2
Ligand
BDBM119918
Substrate
Meas. Tech.
IMAP Assay
pH
7.2±n/a
IC50
9.3±n/a nM
Citation
 Cook, BNKowalski, JALi, XMarshall, DRSchlyer, SSibley, RSmith-Keenan, LLSoleymanzadeh, FSorcek, RJYoung, ERZhang, Y Rho kinase inhibitors US Patent  US8697911 Publication Date 4/15/2014 
Target
Name:
Rho-associated protein kinase 2
Synonyms:
KIAA0619 ROCK2 Rho kinase 2 (ROCKII) Rho-associated protein kinase 2 (ROCK2) Rho-associated protein kinase 2/Transforming protein RhoA Rho-associated, coiled-coil-containing protein kinase II p164 ROCK-2
Type:
Protein
Mol. Mass.:
160885.43
Organism:
Homo sapiens (Human)
Description:
O75116
Residue:
1388
  
Inhibitor
Name:
BDBM119918
Synonyms:
US8697911, 44
Type:
Small organic molecule
Emp. Form.:
C21H22N10O3S
Mol. Mass.:
494.53
SMILES:
CN1CCc2nc(NC(=O)c3cccc(CNC(=O)c4nnn(c4C)-c4nonc4N)c3)sc2C1
: