Target
Rho-associated protein kinase 2
Ligand
BDBM119944
Substrate
Meas. Tech.
IMAP Assay
pH
7.2±n/a
IC50
1.25±n/a nM
Citation
 Cook, BNKowalski, JALi, XMarshall, DRSchlyer, SSibley, RSmith-Keenan, LLSoleymanzadeh, FSorcek, RJYoung, ERZhang, Y Rho kinase inhibitors US Patent  US8697911 Publication Date 4/15/2014 
Target
Name:
Rho-associated protein kinase 2
Synonyms:
KIAA0619 ROCK2 Rho kinase 2 (ROCKII) Rho-associated protein kinase 2 (ROCK2) Rho-associated protein kinase 2/Transforming protein RhoA Rho-associated, coiled-coil-containing protein kinase II p164 ROCK-2
Type:
Protein
Mol. Mass.:
160885.43
Organism:
Homo sapiens (Human)
Description:
O75116
Residue:
1388
  
Inhibitor
Name:
BDBM119944
Synonyms:
US8697911, 95
Type:
Small organic molecule
Emp. Form.:
C28H27N5O2S
Mol. Mass.:
497.611
SMILES:
CN1CCc2ccc(NC(=O)c3cccc(CNC(=O)c4sc(nc4C)-c4ccncc4)c3)cc2C1
: