Target
Mitogen-activated protein kinase 1
Ligand
BDBM120101
Substrate
Meas. Tech.
Enzymatic Assay
pH
7.3±n/a
IC50
6.3±n/a nM
Comments
extracted
Citation
 Blake, JFChicarelli, MJGarrey, RFGaudino, JGrina, JMoreno, DAMohr, PJRen, LSchwarz, JChen, HRobarge, KZhou, A Serine/threonine kinase inhibitors US Patent  US8697715 Publication Date 4/15/2014 
Target
Name:
Mitogen-activated protein kinase 1
Synonyms:
ERK2 Extracellular signal-regulated kinase 2 Extracellular signal-regulated kinase 2 (ERK2) MAPK 2 MK01_HUMAN Mitogen-activated protein kinase 1 (ERK-2) Mitogen-activated protein kinase 2 PRKM2 | p42-MAPK
Type:
Ser/Thr Protein Kinase
Mol. Mass.:
41392.76
Organism:
Homo sapiens (Human)
Description:
P28482
Residue:
360
  
Inhibitor
Name:
BDBM120101
Synonyms:
US8697715, 65 | US9259470, 65
Type:
Small organic molecule
Emp. Form.:
C21H22ClFN4O4
Mol. Mass.:
448.875
SMILES:
COC[C@@H](CO)Nc1nccc(n1)-c1ccn([C@H](CO)c2ccc(Cl)c(F)c2)c(=O)c1
: